Date,Sex,Age,Residence City,Death City,Heroin,Cocaine,Fentanyl,Oxycodone,Oxymorphone,EtOH,Hydrocodone,Benzodiazepine,Methadone,Amphet,Tramad,Morphine (not heroin),Other,Any Opioid
11/29/16,Male,41,NEW HAVEN,NEW HAVEN,,,Y,,,,,,,,,,,
7/13/16,Female,48,ENFIELD,HARTFORD,Y,,Y,Y,,,,Y,,,,,,
8/26/16,Male,28,MIDDLETOWN,MIDDLETOWN,Y,,Y,,,,,,,,,,,
9/9/16,Male,40,SHELTON,SHELTON,,,Y,Y,,,,Y,,,,,,
9/13/16,Male,52,,NEW BRITAIN,Y,Y,,,,Y,,,,,,,,
7/2/16,Female,52,SHELTON,SHELTON,,,Y,,,,,Y,,,,,,
11/30/16,Female,33,KILLINGLY,KILLINGLY,Y,,Y,,,,,,,,,,,
8/26/16,Female,22,LEBANON,LEBANON,,,,,,,,,,,,,,
3/18/17,Male,45,NEW HAVEN,NEW HAVEN,,,,,,,,,,,,,,
4/2/17,Male,62,VERNON-ROCKVILLE,VERNON-ROCKVILLE,,,Y,,,,,,,,,,,
2/11/17,Female,46,NORWICH,NORWICH,Y,Y,Y,,,,,,,,,,,
4/22/17,Female,31,UNKNOWN,NEW HAVEN,Y,Y,,,,,,Y,,,,,,
1/19/17,Male,27,UNKNOWN,MIDDLETOWN,Y,Y,,,,,,,,,,,,
3/25/17,Female,37,LONGS,MERIDEN,,,Y,,,,,Y,,,,,,
5/16/17,Female,41,WATERTOWN,WATERTOWN,,,,,,,,,,Y,,,,
5/9/17,Male,55,HARTFORD,HARTFORD,,,Y,,,Y,,Y,,,,,,
3/24/17,Male,34,NORWICH,HARTFORD,Y,,Y,,,,,,,,,,,
1/5/17,Male,50,HARTFORD,HARTFORD,Y,,Y,,,,,,,,,,,
4/30/17,Male,24,WEST HARTFORD,FARMINGTON,,,Y,,,,,,,,,,,
6/30/17,Male,34,NEWINGTON,NEWINGTON,Y,,,,,,Y,Y,,,,,,
6/21/17,Female,48,WATERTOWN,WATERTOWN,,Y,,,,,,,,,,,,
2/3/17,Male,32,SOUTH GLASTONBURY,MIDDLETOWN,,,Y,,,,,Y,,,,,,
5/22/17,Male,42,CHESHIRE,CHESHIRE,,Y,Y,,,,,Y,,,Y,,,
1/25/17,Male,40,PLAINFIELD,NORWICH,,,Y,Y,,,,,,,,,,
1/11/17,Male,28,GROTON,NEW LONDON,Y,,Y,,,,,,,,,,,
4/19/17,Female,60,WEST HARTFORD,WEST HARTFORD,,,,Y,,Y,,Y,,,,,,
6/29/17,Male,58,MILFORD,MILFORD,Y,,Y,,,,,Y,,Y,,,,
2/22/17,Female,61,HARTFORD,HARTFORD,,Y,,,,,,,,,,,,
4/27/17,Male,43,WATERBURY,TORRINGTON,Y,Y,,,,,,,,,,,,
1/30/17,Female,45,BRIDGEPORT,BRIDGEPORT,Y,,Y,,,,,,,,,,,
3/20/17,Male,63,ANSONIA,ANSONIA,,Y,,,,,,,,,,,,
5/15/17,Male,51,TORRINGTON,TORRINGTON,Y,,Y,,,Y,,,,,,,,
3/9/17,Male,42,DANIELSON,DANIELSON,,,Y,,,,,,,,,,,
1/20/17,Male,50,NEW HAVEN,NEW HAVEN,Y,,,,,,,,,,,,,
3/29/17,Male,38,BRIDGEPORT,STRATFORD,Y,Y,,,,Y,,,,Y,,,,
4/15/17,Female,19,ENFIELD,ENFIELD,,,Y,,,,,,,,,,,
5/31/17,Male,55,STAMFORD,STAMFORD,,Y,,,,Y,,,,,,,,
4/9/17,Male,34,EAST HAMPTON,HARTFORD,,,Y,,,,,,,,,,,
4/21/17,Male,29,SOUTHINGTON,SOUTHINGTON,,,Y,,,,,,,,,,,
2/25/17,Male,38,NEW BRITAIN,NEW BRITAIN,,,Y,,,,,Y,,,,,,
6/18/17,Male,34,EASTON,EASTON,Y,,Y,,,,,,,,,,,
6/6/17,Male,26,VOLUNTOWN,VOLUNTOWN,,,Y,,,,,,,,,,,
5/9/17,Male,43,WESTFIELD,NEW BRITAIN,,,Y,,,,,Y,,,,,,
4/21/17,Female,55,MILFORD,MILFORD,,,,,,Y,,,,,, Y,MORPHINE, 
6/28/17,Male,47,TERRYVILLE,TERRYVILLE,,,Y,,,,,,,,,,,
3/31/17,Female,52,WATERBURY,WATERBURY,,,,,,,,,Y,,,,,
3/3/17,Female,39,MANCHESTER,MANCHESTER,Y,,Y,,,Y,,,,,,,,
5/18/17,Male,48,HARTFORD,HARTFORD,,Y,,,,,,,,,,,,
2/26/17,Male,49,HARTFORD,HARTFORD,Y,Y,,,,,,,,,,,,
3/27/17,Male,60,HARTFORD,HARTFORD,Y,,,,,,,,,,,,,
4/2/17,Male,56,NEWINGTON,NEWINGTON,,Y,,,,,,,,,,,,
6/13/17,Male,44,EAST HARTFORD,EAST HARTFORD,,,Y,,,,,,,,,,,
2/26/17,Male,62,SEBRING,HARTFORD,,Y,,,,,,Y,,Y,,,,
5/21/17,Female,38,MILFORD,MILFORD,Y,,,,,Y,,Y,,,,,,
5/6/17,Male,45,STAFFORD,STAFFORD,Y,,Y,,,,,,,,,,,
3/10/17,Male,51,NEW LONDON,6340,,Y,Y,,,,,,,,,,,
6/10/17,Male,43,STRATFORD,STRATFORD,Y,,Y,,,,,,,,,,,
6/26/17,Male,41,BRISTOL,BRISTOL,Y,Y,Y,,,,,Y,Y,,,,,
3/4/17,Male,46,TOLLAND,TOLLAND,Y,,Y,,,,,,,,,,,
3/10/17,Female,35,MIDDLETOWN,MIDDLETOWN,,Y,Y,,,,,,,,,,,
5/1/17,Male,36,NORWICH,NEW LONDON,,,Y,,,Y,,,,,,,,
1/4/17,Male,27,DANBURY,DANBURY,Y,Y,,,,,,Y,,,,,,
5/29/17,Male,45,WATERBURY,WATERBURY,Y,Y,Y,,,,,,,,,,,
4/14/17,Male,37,ONECO,ONECO,Y,,Y,,,Y,,Y,,,,,,
5/8/17,Male,45,VERNON,PLAINVILLE,Y,Y,,,,,,,,,,,,
5/2/17,Male,31,DANBURY,DANBURY,Y,,Y,,,,,,,,,,,
2/8/17,Female,25,NEW BRITAIN,NEW BRITAIN,,,Y,,,,,Y,Y,,,,,
5/11/17,Male,56,STRATFORD,BRIDGEPORT,,,Y,Y,,,,,,,,,,
4/11/17,Male,49,NEWINGTON,NEWINGTON,Y,Y,,,,,,,,,,,,
4/11/17,Male,30,TORRINGTON,HARTFORD,,,Y,,,,,,,,,,,
2/5/17,Male,55,SHELTON,SHELTON,Y,,,,,,,,,,,,,
5/5/17,Female,35,NEW HAVEN,NEW HAVEN,Y,,,,,,,,,,,,,
5/3/17,Female,55,NAUGATUCK,NAUGATUCK,Y,,Y,,,,,Y,,,,,,
3/31/17,Female,29,UNKNOWN,HARTFORD,Y,Y,Y,,,,,,,,,,,
3/5/17,Male,24,OXFORD,DERBY,Y,,Y,,,,,,,,,,,
3/26/17,Female,62,WATERBURY,WATERBURY,,,,,,,,Y,Y,,,,,
6/13/17,Male,60,STRATFORD,STRATFORD,,,,Y,Y,,,,,,,Y,MORPHINE, 
4/11/17,Female,56,AVON,FARMINGTON,,,,Y,,Y,,,,,,,,
5/24/17,Female,44,UNKNOWN,TORRINGTON,Y,,Y,,,,,Y,,,,,,
6/1/17,Male,50,MANCHESTER,MANCHESTER,,,Y,,,,,,,,,,,
5/29/17,Male,60,WILLIMANTIC,WILLIMANTIC,,,,,,,,,Y,,,,,
6/5/17,Male,25,UNKNOWN,BRIDGEPORT,Y,Y,Y,,,Y,,,,,,,,
6/29/17,Male,21,FAIRFIELD,FAIRFIELD,Y,,Y,,,,,,,,,,,
6/14/17,Male,54,NEW BRITAIN,NEW BRITAIN,,,Y,,,,,,,,,,,
6/4/17,Female,58,SOUTHBURY,SOUTHBURY,,Y,,,,,,,,,,,,
2/15/17,Female,58,HARTFORD,HARTFORD,,,Y,,,,,Y,,,,,,
3/20/17,Male,56,WEST HAVEN,WEST HAVEN,Y,,,,,,,,,,,,,
4/2/17,Male,26,PORT CHESTER,GREENWICH,Y,Y,Y,,,,,,,,,,,
1/17/17,Female,49,NEWINGTON,NEWINGTON,,,Y,,,,,,,,,,,
6/3/17,Female,50,NORWICH,NORWICH,,,Y,,,Y,,,,,,,,
5/20/17,Male,51,BRIDGEPORT,BRIDGEPORT,,,Y,,,Y,,,,,,,CARFENTANIL,
6/18/17,Female,28,SHELTON,DERBY,Y,,Y,,,,,,,,,,,
2/18/17,Male,33,UNKNOWN,WATERBURY,,Y,Y,,,,,,,,,,,
2/17/17,Male,49,NEW HAVEN,NEW HAVEN,,Y,,,,,,,,,,,,
3/2/17,Male,59,MIDDLETOWN,MIDDLETOWN,,Y,,,,,,,,,,,,
6/10/17,Male,54,BRIDGEPORT,BRIDGEPORT,,,,,,Y,,,Y,,,,,
1/21/17,Male,51,AMENIA,WINSTED,Y,Y,,,,,,,,,,,,
1/22/17,Male,35,ENFIELD,ENFIELD,Y,Y,,,,,,,,,,,,
6/9/17,Male,23,BRISTOL,BRISTOL,,,Y,,,,,,,,,,,
2/10/17,Male,30,MANCHESTER,MANCHESTER,,,Y,,,,,,,,,,,
6/2/17,Male,29,NORWICH,NORWICH,Y,,Y,,,,,,,,,,,
1/5/17,Male,32,UNKNOWN,WATERBURY,Y,Y,Y,,,,,Y,,,,,,
4/24/17,Female,42,ENFIELD,ENFIELD,,Y,Y,,,,,,,,,,,
3/19/17,Male,52,UNKNOWN,BRISTOL,,Y,Y,Y,,,,,,,,,,
5/19/17,Male,37,BEACON FALLS,WATERBURY,Y,,Y,,,,,,,,,,,
4/10/17,Male,59,WATERBURY,WATERBURY,Y,,,,,Y,,Y,,,Y,,,
6/20/17,Male,61,MANCHESTER,MANCHESTER,,,Y,,,,,,,,,,,
1/11/17,Female,47,NEW HAVEN,NEW HAVEN,,Y,,,,,,,,,,,,
2/4/17,Male,50,SOMERS,ENFIELD,Y,Y,Y,,,,,,,,,,,
4/18/17,Male,45,TRUMBULL,TRUMBULL,,,Y,,,,,,Y,,,,,
4/27/17,Female,34,SHELTON,SHELTON,Y,,,,,,,Y,Y,Y,,,,
1/31/17,Male,30,CHESHIRE,CHESHIRE,,,,Y,,,,Y,,,,,,
2/14/17,Female,33,MERIDEN,MERIDEN,Y,,Y,,,,,Y,,,,,,
3/13/17,Male,47,BRIDGEPORT,BRIDGEPORT,,Y,,,,,,,,,,,,
6/7/17,Male,40,MANCHESTER,MANCHESTER,,,Y,,,,,Y,,,,,,
6/21/17,Male,33,NEW BRITAIN,NEW BRITAIN,,Y,Y,,,,,,,,,,,
4/28/17,Female,55,EAST HARTFORD,EAST HARTFORD,,Y,Y,,,,,,,,,,,
2/13/17,Male,44,MOUNT VERNON,DANBURY, ,Y,,,,,,,,,, ,,Y
4/10/17,Male,47,HARTFORD,HARTFORD,,,Y,,,,,,,,,,,
1/6/17,Male,49,NEWINGTON,HARTFORD,Y,Y,Y,,,,,,,,,,,
3/10/17,Male,37,NORWICH,NORWICH,Y,,Y,,,,,Y,Y,,,,,
5/20/17,Male,45,UNKNOWN,NORWICH,,Y,,,,,,,,,,,,
2/4/17,Male,56,UNKNOWN,ENFIELD,Y,Y,Y,,,,,Y,,,,,,
1/24/17,Female,35,MILFORD,MILFORD,,,Y,,,,,,,,,,,
2/28/17,Male,25,WALLINGFORD,MERIDEN,,,Y,,,,,Y,,,,,,
1/20/17,Male,28,ANSONIA,ANSONIA,Y,,,,,,,,,,,,,
1/11/17,Female,34,NEWINGTON,NEWINGTON,Y,Y,,,,Y,,,,,,,,
2/17/17,Male,40,SEYMOUR,SEYMOUR,Y,Y,Y,,,,,,,,,,,
4/13/17,Male,60,HARTFORD,HARTFORD,,,,,,,,,,,,,,Y
2/9/17,Male,36,PLAINFIELD,PLAINFIELD,Y,,Y,,,Y,,,,,,,,
6/1/17,Female,53,SOUTHINGTON,SOUTHINGTON,Y,,Y,,,,,,Y,,,,,
4/16/17,Male,59,BRISTOL,BRISTOL,,,Y,,,,,,Y,,,,,
6/4/17,Male,53,MERIDEN,MERIDEN,Y,Y,,,,,,,,,,,,
1/15/17,Male,40,EAST GRANBY,EAST GRANBY,Y,,Y,,,,,,,,,,,
5/19/17,Male,41,WATERBURY,WATERBURY,,,Y,,,,,Y,,,,,,
3/25/17,Male,43,CANTERBURY,CANTERBURY,Y,,Y,,,,,,,,,,,
6/10/17,Female,20,STAMFORD,BRIDGEPORT,Y,Y,Y,,,,,,,,,,,
1/5/17,Male,42,ROSLINDALE,WATERBURY,Y,,Y,,,,,,,,,,,
3/15/17,Male,37,WATERBURY,WATERBURY,,,Y,,,,,Y,,,,,,
5/3/17,Male,54,HARTFORD,HARTFORD,Y,,,,,Y,,,Y,,, , , 
2/2/17,Male,64,MILFORD,MILFORD,,,,Y,,,,,,,,,,
6/25/17,Female,33,NEW HAVEN,NEW HAVEN,Y,Y,Y,,,,,,,,,,,
6/18/17,Male,23,BURLINGTON,BRISTOL,,,Y,,,,,Y,,,,,,
6/30/17,Male,52,WILLIMANTIC,HARTFORD,,,Y,,,,,Y,,,,,,
6/10/17,Male,39,CLINTON,CLINTON,,,Y,,,,,,,,,,,
4/22/17,Female,39,UNKNOWN,MOOSUP,,,Y,,,,,,,,,,,
2/7/17,Female,22,EASTON,NORWALK,Y,,Y,,,,,,,,,,,
6/13/17,Female,63,UNKNOWN,BROOKFIELD,,,Y,,,Y,,,,,,,,
5/9/17,Male,50,WEST HAVEN,WEST HAVEN,,,Y,,,,,,,,,,,
3/26/17,Male,66,VERNON,VERNON,,,Y,,,,,,,,,,,
6/14/17,Male,47,NEW HAVEN,NEW HAVEN,Y,,,,,,,,,,,,,
3/5/17,Female,54,EAST HAMPTON,EAST HAMPTON,,,,,,Y,,,,,,,,
1/30/17,Male,40,NEW HAVEN,NEW HAVEN,Y,Y,Y,,,,,,,,,,,
2/20/17,Female,39,MILFORD,MILFORD,,,,,,Y,,Y,Y,,,,,
3/29/17,Male,35,WATERBURY,HARTFORD,Y,Y,Y,,,,,Y,,,,,,
5/4/17,Male,41,HAMDEN,HAMDEN,Y,Y,Y,,,,,,Y,,,,,
2/5/17,Male,37,PRESTON,PRESTON,,,Y,Y,,,,,,,,,,
1/29/17,Male,47,STAMFORD,STAMFORD,,,,,,Y,,,,,,,,
3/5/17,Female,40,KILLINGLY,KILLINGLY,,,,,,,,Y,Y,,,,,
1/9/17,Male,39,WATERBURY,DERBY,Y,Y,,,,,,Y,,,,,,
2/26/17,Male,30,NORWICH,NORWICH,Y,,Y,,,,,,,,,,,
6/15/17,Male,49,MIDDLETOWN,MIDDLETOWN,,,Y,,,,,,,,,,,
3/18/17,Female,51,BRISTOL,BRISTOL,,Y,,,,,,Y,,,,,,
3/10/17,Female,27,EAST HAVEN,EAST HAVEN,,Y,Y,,,,,,Y,,,,,
1/24/17,Male,29,STAMFORD,STAMFORD,,,,Y,Y,,,Y,,,,,,
4/8/17,Female,58,NEW HAVEN,NEW HAVEN,,,,,,,,,Y,,,,,
5/5/17,Male,64,BLOOMFIELD,NEW BRITAIN,Y,,,,,,,,,,,,,
3/9/17,Male,52,HARTFORD,HARTFORD,,,Y,,,,,,,,,,,
1/18/17,Male,35,ANSONIA,ANSONIA,,,,,,,,Y,,,,,,
1/22/17,Male,36,GROTON,GROTON,,,,,,,,,Y,,,,,
3/21/17,Male,29,ENFIELD,ENFIELD,Y,,Y,,,,,Y,,,,,,
4/8/17,Male,34,MIDDLETOWN,MIDDLETOWN,Y,,Y,,,,,,,,,,,
3/8/17,Female,51,WEST HAVEN,NEW HAVEN,,,,,,,,,,Y,Y,,,
4/7/17,Male,41,ENFIELD,ENFIELD,Y,Y,,,,,,,,,,,,
6/16/17,Male,50,WEST HAVEN,NEW HAVEN,Y,,Y,,,,,Y,,,,,,
1/22/17,Male,35,NIANTIC,NEW LONDON,Y,,Y,,,,,Y,,,,,,
5/18/17,Male,31,BRANFORD,BRANFORD,,,Y,,,,,,,,,,,
5/5/17,Male,27,WINSTED,WINSTED,Y,,,,,,,,,,,,,
1/11/17,Female,55,NEW BRITAIN,HARTFORD,Y,,Y,,,,,,,,,,,
1/20/17,Male,54,HARTFORD,HARTFORD,Y,,Y,,,,,,,,, , , 
2/9/17,Male,45,TORRINGTON,TORRINGTON,,,Y,,,,,,,,,,,
6/28/17,Male,67,DERBY,DERBY,Y,,,,,,,Y,,,,,,
5/12/17,Male,53,NORWICH,NORWICH,Y,Y,Y,,,,,,,,,,,
4/19/17,Male,49,SALEM,SALEM,Y,,,,Y,,,Y,,,,,,
3/30/17,Male,31,CHESHIRE,NEW HAVEN,,Y,,,,Y,,,Y,,,,,
4/11/17,Male,36,BETHEL,BETHEL,,,Y,,,,,Y,,,,,,
4/3/17,Male,29,NORWICH,NORWICH,Y,Y,Y,,,,,Y,,,,,,
6/1/17,Male,71,WILLIMANTIC,WILLIMANTIC,,,,Y,,,,,,,,,,
6/2/17,Male,59,HARTFORD,HARTFORD,,Y,Y,,,,,,,,,,,
6/30/17,Male,50,GUILFORD,GUILFORD,Y,,,,,,,Y,,,,,,
2/16/17,Male,23,NAUGATUCK,NAUGATUCK,,,,,,,,Y,Y,,,,,
5/5/17,Male,46,BRANFORD,NEW HAVEN, ,,,,,,,,,,,Y,MORPHINE, 
5/24/17,Female,54,DANBURY,DANBURY,Y,,Y,,,,,,,,,,,
3/19/17,Male,38,NEW BRITAIN,NEW BRITAIN,Y,,Y,,,,,Y,,,,,,
1/13/17,Male,27,OAKVILLE,WATERTOWN,Y,,,,,,,Y,,,,,,
5/2/17,Male,55,BRIDGEPORT,BRIDGEPORT,Y,Y,,,,,,Y,,,,,,
1/5/17,Male,23,DANBURY,DANBURY,,,Y,,,,,,,,,,,
5/6/17,Female,37,TORRINGTON,TORRINGTON,,,,,,,,Y,Y,,Y,,,
5/30/17,Female,27,EAST HAVEN,EAST HAVEN,Y,,Y,,,,,Y,Y,,,,,
1/7/17,Male,48,MIDDLETOWN,MIDDLETOWN,,,Y,,,,,,,,,,,
5/26/17,Male,45,UNKNOWN,HARTFORD,,Y,Y,,,,,,,,,,,
4/8/17,Female,31,OXFORD,DERBY,Y,,,,,,,Y,,,,,,
3/19/17,Female,64,SHELTON,SHELTON,,,,Y,,,,,,,,,,
1/8/17,Male,47,DEEP RIVER,DEEP RIVER,Y,,Y,,,,,,,,,,,
6/8/17,Female,59,SHARON,SHARON,,,,Y,,,,Y,,,,Y,MORPHINE, 
2/2/17,Female,35,MERIDEN,NEW HAVEN,Y,,Y,,,,,Y,,,,,,
1/3/17,Female,45,NEW LONDON,NEW LONDON,Y,Y,,,,,,,,,,,,
2/7/17,Male,23,EAST HARTFORD,HARTFORD,,,Y,,,,,Y,,,,,,
4/5/17,Female,51,WINDHAM,WINDHAM,Y,,Y,,,,,,,,,,,
2/3/17,Female,25,PLAINVILLE,BRISTOL,Y,Y,Y,,,,,,,,,,,
6/10/17,Male,24,BRANFORD,NEW HAVEN,Y,,Y,,,,,,,,,,,
1/10/17,Male,72,TORRINGTON,TORRINGTON, ,,,,,,,Y,,,, ,,Y
2/13/17,Female,38,NEW LONDON,NEW LONDON,,,,,,,,,,,,,,
2/12/17,Male,29,WILLIMANTIC,WILLIMANTIC,,,,Y,,,,,,,,,,
1/5/17,Female,47,EAST HARTFORD,WINDSOR,Y,Y,Y,,,,,,,,,,,
2/11/17,Male,57,WETHERSFIELD,WETHERSFIELD,Y,,Y,,,,,,,,,,,
5/5/17,Male,35,WATERBURY,WATERBURY,,Y,Y,,,,,,,,,,,
2/6/17,Male,54,BRIDGEPORT,BRIDGEPORT,,Y,,,,,,,Y,,,,,
3/12/17,Male,48,WATERBURY,WATERBURY,,Y,,,,,,,,,Y,,,
6/19/17,Female,66,NEW HAVEN,NEW HAVEN,Y,,,,,,,,,,,,,
5/26/17,Female,57,SALISBURY,SALISBURY,,,,,,Y,Y,Y,,,,,,
4/14/17,Female,42,BRANFORD,BRANFORD,,,,,,,,Y,Y,Y,,,,
5/23/17,Male,34,NEW HAVEN,NEW HAVEN,Y,,Y,,,,,,Y,,,,,
6/7/17,Male,55,CLINTON,CLINTON,,,,,,Y,,,,,,,,
5/20/17,Female,57,WATERBURY,WATERBURY,,,,,,,,Y,Y,,,,,
3/31/17,Male,26,NORWICH,NORWICH,Y,Y,Y,,,,,,,,,,,
4/8/17,Male,47,NORWICH,NORWICH,,,,,,,,,Y,,,,,
3/10/17,Male,59,BERLIN,BERLIN,Y,Y,,,,,,,,,,,,
5/16/17,Male,50,EAST HARTFORD,WATERBURY,Y,Y,Y,,,,,,,,,,,
3/5/17,Male,58,WOODBRIDGE,WOODBRIDGE,,,,Y,,,,,,,Y,,,
2/5/17,Female,56,NORWALK,NORWALK,,Y,,,,,,,,,,,,
5/23/17,Male,53,UNKNOWN,NEW LONDON,,,Y,,,Y,,,,,,,,
6/9/17,Male,59,BEACON FALLS,BEACON FALLS,Y,,,,,,,,,,,,,
5/14/17,Male,38,MADISON,NAUGATUCK,Y,Y,Y,,,Y,,,,,,,,
2/3/17,Female,51,MERIDEN,MERIDEN,,Y,,,,,,,,,,,,
5/29/17,Male,49,UNKNOWN,NAUGATUCK,Y,,Y,,,,,,,,,,,
2/8/17,Male,60,SOUTHINGTON,SOUTHINGTON,,Y,,,,,,,,,,,,
3/2/17,Female,44,BRANFORD,BRANFORD,,,,,,,Y,Y,,,,,,
2/8/17,Female,57,NEW BRITAIN,NEW BRITAIN,,,,Y,,,,Y,,Y,,,,
1/29/17,Male,53,MANCHESTER,WETHERSFIELD,Y,Y,,,,Y,,,,,, , , 
3/11/17,Male,32,SOUTH WINDSOR,EAST HARTFORD,,Y,Y,,,,,,,,,,,
5/31/17,Male,52,KENT,KENT,,,,Y,,,,,,,,,,
1/15/17,Female,41,ORANGE,MILFORD,,,Y,,,,,,,,,,,
5/14/17,Male,47,NORTH BRANFORD,EAST HAVEN,Y,Y,Y,,,,,,,,,,,
1/31/17,Male,53,STAMFORD,STAMFORD,,Y,Y,,,Y,,,,Y,,,,
2/6/17,Male,57,LEBANON,MANCHESTER,Y,,,,,,,,,,,,,
5/3/17,Male,26,HARTFORD,HARTFORD,Y,,Y,,,,,,,,,,,
1/20/17,Male,58,TORRINGTON,TORRINGTON,Y,,,,,,,Y,,,,,,
1/10/17,Female,40,NAUGATUCK,NAUGATUCK,,,,Y,,Y,,,,,,,,
5/7/17,Male,52,LISBON,PLAINFIELD,Y,Y,,,,,,,,,,,,
6/28/17,Male,24,JEWETT CITY,NORWICH,,,Y,,,,,,,,,,,
1/12/17,Female,36,WATERBURY,WATERBURY,Y,Y,Y,,,,,,,,,,,
6/19/17,Female,32,GREENFIELD,WATERBURY,,,,,,Y,,Y,,,,,,
3/17/17,Male,20,EAST HADDAM,EAST HADDAM,Y,Y,Y,,,,,,,,,,,
2/2/17,Female,44,NEW LONDON,CHAPLIN,,Y,,,,,,,,,,,,
5/9/17,Male,36,UNKNOWN,BRIDGEPORT,Y,Y,Y,,,,,,,,,,,
2/16/17,Male,24,FARMINGTON,FARMINGTON,Y,,Y,,,Y,,,,,,,,
6/12/17,Male,52,FARMINGTON,FARMINGTON,,Y,Y,,,,,,,,,,,
2/1/17,Male,26,WATERBURY,WATERBURY,,Y,Y,,,,,,,,,,,
6/4/17,Male,60,SEYMOUR,SEYMOUR,Y,,Y,,,,,,,,,,,
1/20/17,Female,25,EAST HAVEN,NEW HAVEN,Y,,Y,,,,,Y,,,, ,, 
5/13/17,Male,31,TRUMBULL,BRIDGEPORT,,,,,,,,,,,,,,Y
3/5/17,Male,33,MANCHESTER,IVORYTON,Y,Y,Y,,,,,,,,,,,
3/18/17,Male,53,COLCHESTER,COLCHESTER,Y,Y,Y,,,,,Y,,,,,,
6/5/17,Male,34,NORTH GROSVENORDALE,NORTH GROSVENORDALE,Y,,Y,,,,,,,,,,,
5/11/17,Male,37,BLOOMFIELD,BLOOMFIELD,,Y,,,,Y,,,,,,,,
3/22/17,Male,39,CROMWELL,CROMWELL,,,Y,Y,,,,Y,,,,,,
1/9/17,Male,58,HARTFORD,HARTFORD,Y,Y,Y,,,Y,,,,,,,,
1/22/17,Male,35,BRANFORD,BRANFORD,Y,Y,Y,,,,,Y,,,, ,, 
2/15/17,Male,34,SHELTON,BRIDGEPORT,,,,,,,,,,,,,,
1/3/17,Male,36,MERIDEN,MERIDEN,,,,,,,,,,Y,,,MDMA,
6/29/17,Female,65,NEWINGTON,NEWINGTON,,,,,,Y,,,,,Y,,,
5/1/17,Female,52,BRIDGEPORT,BRIDGEPORT,Y,,,,,Y,,,,,,,,
5/9/17,Female,36,CHAPLIN,ASHFORD,Y,Y,,,,Y,,,,,,,,
1/23/17,Male,64,HARTFORD,HARTFORD,Y,,Y,,,,,,Y,,,,,
1/11/17,Male,30,EAST HARTFORD,HARTFORD,Y,,Y,,,,,,,,,,,
2/16/17,Male,64,NEW LONDON,NEW LONDON,,Y,,,,,,,,,,,,
5/2/17,Female,46,WEST HAVEN,WEST HAVEN,Y,Y,Y,,,,,Y,Y,,,,,
2/6/17,Female,37,BRISTOL,BRISTOL,,,,,,,,Y,,,,,,
5/1/17,Male,33,UNIONVILLE,UNIONVILLE,Y,,Y,,,,,Y,,,,,,
2/3/17,Female,46,NEW BRITAIN,NEW BRITAIN,Y,Y,,,,,,,,,,,,
3/20/17,Male,30,FAIRFIELD,SEYMOUR,Y,,Y,,,,,Y,,,,,,
6/25/17,Male,35,UNKNOWN,NEW HAVEN,,,Y,,,,,,,,,,,
3/5/17,Male,33,NEW BRITAIN,NEW BRITAIN,,,Y,,,Y,,,,,,,,
3/29/17,Female,62,NEW BRITAIN,NEW BRITAIN,,,Y,,,,,,,,,,,
5/14/17,Female,58,SEYMOUR,DERBY,Y,,,,,,,,,,,,,
4/23/17,Male,43,MERIDEN,MERIDEN,,Y,Y,Y,,,,,,,,,,
1/13/17,Male,44,MERIDEN,MERIDEN,Y,,Y,,,,,,,,,,,
5/29/17,Male,66,BLOOMFIELD,BLOOMFIELD,Y,,Y,,,,,,,,, , ,
5/27/17,Male,46,UNKNOWN,HARTFORD,,,Y,,,,,,,,,,,
6/18/17,Male,32,FARMINGTON,MANCHESTER,,,Y,,,,,,,,,,,
2/21/17,Male,28,WEST HAVEN,WEST HAVEN,,,Y,,,,,,,,,,,
3/16/17,Male,51,LEDYARD,LEDYARD,,,Y,,,,,,,,Y,,,
5/8/17,Female,50,NEW BRITAIN,NEW BRITAIN,,,Y,,,,,,,,,,,
2/2/17,Male,50,UNKNOWN,NEW BRITAIN,,,,,,Y,,,,,,,,
5/9/17,Male,33,MERIDEN,MERIDEN,Y,,Y,,,,,Y,,,,,,
3/23/17,Male,51,SHELTON,SHELTON,Y,Y,Y,,,,,,,,,,,
2/6/17,Male,42,EAST HARTFORD,EAST HARTFORD,Y,,Y,,,,,,,,,,,
5/13/17,Male,30,ENFIELD,ENFIELD,Y,,,,,,,,,,,,,
3/25/17,Male,64,DURHAM,HARTFORD,,Y,,,,,,,,,,,,
6/30/17,Male,43,NEW LONDON,NEW LONDON,,Y,Y,,,,,,,,,,,
1/9/17,Female,48,NORWALK,NORWALK,Y,Y,,,,,,Y,,,,,,
6/18/17,Male,35,BRANFORD,BRANFORD,Y,,,,,,,,,,,,,
2/6/17,Male,24,DEEP RIVER,DEEP RIVER,,,Y,,,Y,,,,,,,,
3/11/17,Female,23,UNKNOWN,STERLING,,,,Y,Y,,,,Y,Y,,,,
5/2/17,Male,61,NAUGATUCK,NAUGATUCK,Y,,Y,,,,,,,,,,,
6/17/17,Male,55,NORWICH,NORWICH,,Y,,,,,,,,,,,,
6/5/17,Male,64,BRISTOL,BRISTOL,,,,,,,,Y,,,,,,
6/21/17,Male,48,BERLIN,BERLIN,Y,,Y,,,,,Y,,,, , , 
2/15/17,Female,23,BARKHAMSTED,ENFIELD,,,Y,,,,,,,,,,,
2/27/17,Male,46,BRIDGEPORT,BRIDGEPORT,,,Y,,,Y,,,,,,,,
1/13/17,Female,40,HAMPTON,HAMPTON,,Y,Y,,,,,,,,,,,
3/24/17,Male,28,WATERBURY,WATERBURY,Y,Y,,,,,,,,,,,,
1/31/17,Male,33,GUILFORD,NEW HAVEN,Y,,,,,,,Y,,,, , , 
4/26/17,Male,46,WATERTOWN,WATERTOWN,Y,Y,Y,,,,,,,,,,,
5/12/17,Male,33,WATERBURY,WATERBURY,,Y,Y,Y,,,,,,,,,,
2/11/17,Male,26,STAFFORD SPRINGS,STAFFORD SPRINGS,,,Y,,,,,,,,,,,
1/1/17,Female,35,PROSPECT,BRISTOL,,Y,Y,,,,,,,,,,,
2/11/17,Male,41,MIDDLETOWN,HARTFORD,Y,,Y,,,,,,,,,,,
4/17/17,Male,32,NORWALK,NORWALK,Y,,Y,,,,,Y,Y,,,,,
4/1/17,Female,25,UNKNOWN,HARTFORD,Y,Y,Y,,,,,,,,,,,
5/29/17,Male,69,BRIDGEPORT,BRIDGEPORT,Y,,,,,,Y,,,,Y,,,
4/28/17,Female,58,WATERBURY,WATERBURY,,,,Y,,Y,,,,,,,,
6/2/17,Male,36,WALLINGFORD,MERIDEN,,,,,,,,,,,,,,Y
3/31/17,Male,29,ELLINGTON,ELLINGTON,Y,,Y,,,,,,,,,,,
2/26/17,Male,52,UNKNOWN,BRIDGEPORT,,,,,,,,Y,Y,,,,,
5/23/17,Male,40,DANBURY,DANBURY,Y,,Y,,,,,,,,,,,
5/8/17,Male,40,UNKNOWN,BOLTON,,Y,Y,,,,,,,,,,,
4/12/17,Male,27,NEW BRITAIN,NEW BRITAIN,Y,,Y,,,,,,,,, , , 
3/21/17,Male,59,HARTFORD,HARTFORD,,,Y,,,,,,,,,,,
3/6/17,Male,36,NORTH HAVEN,NORTH HAVEN,Y,Y,Y,,,,,Y,Y,,,,,
4/30/17,Male,34,HARTFORD,HARTFORD,Y,Y,Y,,,,,,,,,,,
4/24/17,Male,36,WATERBURY,WATERBURY,Y,Y,,,,,,,,,,,,
6/26/17,Male,37,UNKNOWN,WILLIMANTIC,,,Y,,,,,,,,,,,
2/12/17,Male,39,BRIDGEPORT,BRIDGEPORT,Y,,Y,,,,,Y,,,,,,
3/9/17,Male,51,SOUTH WINDSOR,SOUTH WINDSOR,Y,,Y,,,,,Y,,,,,,
3/3/17,Male,41,NORWICH,NORWICH,,,Y,Y,,,,,,,,,,
4/27/17,Female,52,OXFORD,DERBY,,Y,,,,,,,,,,,,
4/23/17,Male,61,STRATFORD,STRATFORD,Y,,Y,,,,,Y,,,,,,
1/15/17,Male,23,UNKNOWN,NORWICH,Y,,Y,,,,,,,,,,,
5/22/17,Female,62,DANBURY,DANBURY,Y,,,,,,,,,,,,,
6/22/17,Male,62,TORRINGTON,NAUGATUCK,Y,Y,Y,,,,,,,,,,,
5/15/17,Male,55,WOLCOTT,WATERBURY,,Y,,,,,,,,,,,,Y
5/7/17,Male,49,NEW HAVEN,BRANFORD,Y,,Y,,,,,Y,,,,,,
2/6/17,Male,51,BRIDGEPORT,BRIDGEPORT,,Y,Y,,,,,,,,,,,
1/19/17,Female,32,UNKNOWN,HARTFORD,Y,Y,Y,,,,,,,,,,,
6/17/17,Male,62,ROCKVILLE,VERNON,,,Y,,,,Y,,,,,,,
3/9/17,Male,36,SOMERS,HARTFORD,,Y,Y,,,,,,,Y,,,,
2/12/17,Male,31,HAMDEN,NORTH BRANFORD,Y,,Y,,,,,,,,,,,
1/16/17,Female,43,NEW BRITAIN,NEW BRITAIN,Y,Y,Y,,,,,,,,,,,
4/14/17,Male,48,NEW BRITAIN,BRISTOL,,Y,Y,,,,,,,,Y,,,
5/29/17,Male,59,DANBURY,DANBURY,Y,,Y,,,,,,,,,,,
3/5/17,Male,59,EAST HARTFORD,EAST HARTFORD,Y,Y,Y,,,,,Y,,,,,,
6/13/17,Male,37,VERNON,VERNON,,,Y,,,Y,,,,,,,,
2/3/17,Male,38,WATERBURY,WATERBURY,Y,Y,,,,,,,,,,,,
6/21/17,Male,36,WATERBURY,WATERBURY,Y,,Y,,,,,,,,,,,
3/5/17,Male,51,FAIRFIELD,BRIDGEPORT,,Y,,Y,Y,Y,,,,,,,,
4/10/17,Female,68,HARTFORD,HARTFORD,,,,,,,,Y,Y,,,,,
6/23/17,Male,23,PLANTSVILLE,PLANTSVILLE,Y,,,,,,,,,,,,,
3/18/17,Male,36,NEW MILFORD,NEW MILFORD,,,,,,Y,,Y,,,,,,
4/11/17,Male,57,HARTFORD,HARTFORD,,Y,Y,,,,,,,,,,,
3/30/17,Female,59,WEST HAVEN,WEST HAVEN,Y,,Y,,,,,,,,,,,
6/12/17,Female,33,MERIDEN,MERIDEN,Y,Y,Y,,,Y,,,,,,,,
4/14/17,Male,38,HARTFORD,HARTFORD,,Y,Y,,,,,,,,,,,
6/20/17,Male,38,BRIDGEPORT,BRIDGEPORT,Y,,Y,,,,,,,,,,,
2/3/17,Male,47,WINCHESTER,WINCHESTER,Y,Y,Y,,,,,Y,,,,,,
5/26/17,Male,42,MERIDEN,MERIDEN,Y,,Y,,,,,,,,,,,
2/25/17,Male,47,MERIDEN,WATERBURY,Y,,Y,,,,,Y,Y,,,,,
3/11/17,Female,45,BRISTOL,BRISTOL,,,Y,,,,,,,,,,,
2/14/17,Male,41,NEW BRITAIN,WATERBURY,,,Y,Y,,,,,,,,,,
2/7/17,Male,34,NEWINGTON,NEWINGTON,Y,,Y,,,Y,,,,,,,,
1/11/17,Male,52,NORWALK,NORWALK,,,,,,Y,,,,,,,,
1/24/17,Male,53,NAUGATUCK,WATERBURY,Y,,Y,,,,,,,,,,,
3/16/17,Female,40,NEW HAVEN,NEW HAVEN,,,,,,,,Y,Y,,,,,
2/22/17,Female,25,DANBURY,DANBURY,,,,,,Y,,,,,,,,
2/23/17,Male,23,MERIDEN,MERIDEN,Y,,Y,,,,,,,,,,,
4/22/17,Male,37,GROTON,GROTON,Y,,,,,,,,,,,,,
4/9/17,Female,22,DANBURY,DANBURY,,,,,,,,Y,Y,,,,,
6/2/17,Male,26,WEST HARTFORD,WEST HARTFORD,,Y,Y,,,,,,,,,,,
5/12/17,Male,45,PORTLAND,MIDDLETOWN,,,Y,,,,,Y,,,,,,
6/2/17,Male,26,TORRINGTON,TORRINGTON,Y,Y,,,,,,,,,,,,
5/24/17,Male,52,JEWETT CITY,JEWETT CITY,Y,,Y,,,,,,,,,,,
5/16/17,Male,50,WETHERSFIELD,HARTFORD,,Y,,,,,,,,,,,,
3/23/17,Female,29,NORWALK,NORWALK,Y,,,,,,,,,,,,,
4/7/17,Male,37,NORWICH,NORWICH,,,,Y,,,,,,,, ,MORPHINE, 
5/25/17,Male,42,HARTFORD,HARTFORD,Y,,Y,,,Y,,,,,,,,
5/22/17,Male,26,UNKNOWN,WATERBURY,Y,Y,Y,,,,,,,,,,,
6/2/17,Male,38,MERIDEN,MERIDEN,Y,,Y,,,,,Y,,,,,,
3/25/17,Male,57,NEW LONDON,NEW LONDON,Y,Y,,,,,,,,,,,,
3/18/17,Female,57,EAST HARTFORD,EAST HARTFORD,Y,,Y,,,,,Y,,,,,,
6/9/17,Female,30,NEW HARTFORD,TORRINGTON,,,,Y,,,,,,,,,,
6/17/17,Male,30,NEW LONDON,NEW LONDON,,Y,Y,,,Y,,,,,,,,
1/25/17,Male,41,HARTFORD,HARTFORD,Y,Y,Y,,,,,,,,,,,
6/6/17,Male,34,BRIDGEPORT,BRIDGEPORT,Y,,Y,,,,,,Y,,,,,
4/18/17,Male,29,LEDYARD,LEDYARD,,,Y,,,,,Y,,,,,,
6/23/17,Male,21,VERNON,VERNON,,,Y,,,,,,,,,,,
4/6/17,Male,53,OXFORD,STRATFORD,Y,,,,,Y,,,,,,,,
2/11/17,Male,38,GROTON,NEW LONDON,,,Y,,,,,Y,,,Y,,,
1/30/17,Male,36,NEWINGTON,NEWINGTON,Y,Y,Y,,,,,Y,,,,,,
4/29/17,Male,32,NEW MILFORD,NEW MILFORD,Y,,Y,,,,,Y,,,,,,
5/3/17,Female,59,HADDAM,HADDAM,,,Y,,,Y,,,,,,,,
5/17/17,Male,62,KENSINGTON,NEW BRITAIN,,,,,,,,,,,,,,Y
3/13/17,Male,31,PUTNAM,PUTNAM,Y,,Y,,,,,,,,,,,
2/24/17,Female,57,MERIDEN,MERIDEN,,,,,,,,Y,,Y,Y,,,
2/5/17,Male,33,NEW BRITAIN,NEW BRITAIN,,,Y,,,,,,,,,,,
3/1/17,Male,57,WINDSOR LOCKS,EAST WINDSOR,Y,,,,,,,,,,,,,
5/5/17,Male,36,PORT READING,HARTFORD,,Y,Y,Y,,,,,,,,,,
6/24/17,Male,32,CHESHIRE,CHESHIRE,Y,Y,Y,,,,,,,,,,,
3/3/17,Male,54,MOOSUP,MOOSUP,Y,,Y,,,,,Y,,,,,,
1/27/17,Male,60,MERIDEN,MERIDEN,,,Y,,,,,,,,,,,
2/8/17,Female,52,MANCHESTER,HARTFORD,,,Y,,,,,,,,,,,
5/23/17,Female,40,KILLINGLY,KILLINGLY,Y,Y,Y,,,,,Y,,,,,,
6/1/17,Male,43,BRIDGEPORT,BRIDGEPORT,Y,,,,,,,,,,,,,
5/22/17,Male,54,TORRINGTON,TORRINGTON,Y,,Y,,,,,,,,,,,
1/2/17,Male,53,HARTFORD,HARTFORD,Y,,Y,,,,,,,,,,,
3/11/17,Male,60,NEW BRITAIN,NEW BRITAIN,Y,,,,,Y,,,,,Y,,,
3/2/17,Male,55,WETHERSFIELD,WETHERSFIELD,Y,,Y,,,,,,,,,,,
2/20/17,Male,30,NEW HAVEN,WATERBURY,Y,Y,,,,,,Y,,,,,,
6/20/17,Male,37,LEBANON,HARTFORD,Y,,,,,,,,,,,,,
6/13/17,Male,57,BLANDFORD,ENFIELD,,Y,,,,,,,,,,,,
5/11/17,Male,39,WALLINGFORD,BRIDGEPORT,,Y,,,,,,,,,,,,
1/29/17,Female,61,COVENTRY,COVENTRY,,,,Y,,,,Y,,,,Y,MORPHINE, 
6/8/17,Female,52,STRATFORD,STRATFORD,Y,,Y,,,,,,,,,,,
4/24/17,Male,62,WESTBROOK,WESTBROOK,,,,Y,,,,Y,,,,,,
4/2/17,Female,41,MILFORD,MILFORD,,,,,,,,Y,,,,,,
4/25/17,Male,31,WEST HARTFORD,HARTFORD,Y,,Y,,,,,,,,,,,
4/27/17,Female,56,WINSTED,TORRINGTON,,,,,,Y,,,Y,,,,,
3/21/17,Male,57,TORRINGTON,TORRINGTON,Y,Y,,,,,,,,,,,,
2/19/17,Male,43,BRISTOL,BRISTOL,Y,,,,,,,,,,,,,
2/24/17,Male,40,HARTFORD,HARTFORD,,,Y,,,,,,,,,,,
3/6/17,Male,33,MERIDEN,MERIDEN,,,Y,,,,,,,,,,,
4/25/17,Male,59,JEWETT CITY,NORWICH,,Y,Y,,,,,Y,,,,,,
3/3/17,Male,27,NEW BRITAIN,NEW BRITAIN,,,Y,,,,,,,,,,,
3/4/17,Male,29,NEW HARTFORD,CANTON,Y,Y,Y,,,,,Y,,Y,,,,
5/27/17,Male,21,NORTHFORD,NEW HAVEN,Y,Y,Y,,,,,,,,,,,
2/19/17,Female,36,BETHANY,BETHANY,,,,,,,Y,,,,,,,
5/11/17,Male,24,TORRINGTON,TORRINGTON,Y,,Y,,,,,,,,,,,
4/20/17,Female,28,NEW HAVEN,NEW HAVEN,Y,Y,Y,,,,,,,,,,,
2/20/17,Female,50,WATERBURY,WATERBURY,,,,Y,,,,,,,,,,
4/4/17,Female,48,DANIELSON,DANIELSON,,Y,,,,Y,,,,,,,,
1/4/17,Male,56,UNKNOWN,WATERBURY,Y,,,,,Y,,,,,,,,
3/19/17,Male,32,NORWICH,LISBON,,,Y,,,Y,,,,,,,,
4/27/17,Female,43,UNKNOWN,WATERBURY,Y,Y,Y,,,Y,,,,,,,,
6/23/17,Male,33,PAWCATUCK,PAWCATUCK,,,Y,,,,,,,,,,,
4/28/17,Female,54,SOUTHINGTON,NEW BRITAIN,Y,,,,,,,Y,,,,,,
1/2/17,Male,53,TORRINGTON,TORRINGTON,Y,,Y,,,,,,,,,,,
5/29/17,Male,35,WINDSOR,WINDSOR,Y,Y,,,,,,Y,,,,,,
3/26/17,Male,61,CANTON,CANTON,,,Y,,,Y,,,,,,,,
2/10/17,Male,42,MIDDLETOWN,HARTFORD,,,Y,,,,,,,,,,,
5/22/17,Male,36,NEW BRITAIN,NEW BRITAIN,Y,Y,Y,,,,,,,,,,,